年間使用日数
type: TerminologyConcept
description: 当該調査の調査日前１年間に、使用した劇場、ホールの使用日数（公演日以外の練習用として使用した日数、他の事業所へ賃貸した日数を含む）。複数の劇場、ホール等の施設がある場合は、最も使用日数が多い日数。
created: 2017-12-01
broader: Ta00359
top concept of: TerminologyConceptScheme
in scheme: TerminologyConceptScheme

RDF description of 年間使用日数
primary topic: 年間使用日数