RDF description of 入場可能定員数
primary topic: 入場可能定員数

入場可能定員数
type: TerminologyConcept
in scheme: TerminologyConceptScheme
top concept of: TerminologyConceptScheme
broader: Ta00146
created: 2017-12-01
description: 可動席を含めた観客席の標準的な席数（立ち見席専用観客スペースを含み、通路・階段等は除く）。