RDF description of 上部消化管内視鏡検査の患者数
primary topic: 上部消化管内視鏡検査の患者数

上部消化管内視鏡検査の患者数
type: TerminologyConcept
in scheme: TerminologyConceptScheme
top concept of: TerminologyConceptScheme
broader: Ta00143
created: 2017-12-01
description: 食道鏡検査、食道ファイバースコピー、胃鏡検査、胃・十二指腸ファイバースコピー、胆道ファイバースコピー、小腸ファイバースコピーの検査の患者数。