SPECT検査装置数
type: TerminologyConcept
description: 患者の体内に投与されたＲＩ（ラジオアイソトープ）の分布を調べる単一光子放出型ＣＴ装置の数。
created: 2017-12-01
broader: Ta00420
in scheme: TerminologyConceptScheme
top concept of: TerminologyConceptScheme

RDF description of SPECT検査装置数
primary topic: SPECT検査装置数