RDF description of 連携保険医療機関等の数
primary topic: 連携保険医療機関等の数

連携保険医療機関等の数
type: TerminologyConcept
in scheme: TerminologyConceptScheme
top concept of: TerminologyConceptScheme
broader: Ta00407
created: 2017-12-01
description: 自施設と、連携している保険医療機関若しくは訪問看護ステーションの施設数の合計。連携している保険医療機関等がない場合は、「１」となる。