臨床研修医数
type: TerminologyConcept
description: 「医師法」（昭和23年法律第201号）第１６条の２第１項の規定に基づき指定を受けた臨床研修病院又は「医師法第十六条の二第一項に規定する臨床研修に関する省令」（平成14年12月11日厚生労働省令第158号）第３条で規定する研修協力施設において、受け入れた臨床研修医のうち、卒後２年以下の前期臨床研修医の人数。
created: 2017-12-01
broader: Ta00119
top concept of: TerminologyConceptScheme
in scheme: TerminologyConceptScheme

RDF description of 臨床研修医数
primary topic: 臨床研修医数