リニアック・マイクロトロン実施の患者数
type: TerminologyConcept
description: 直線加速装置を用いてエネルギーの高い放射線を照射できる放射線治療装置、または回転電極を用いてエネルギーの高い放射線を照射できる放射線治療装置での治療実施の患者数。
created: 2017-12-01
broader: Ta00143
top concept of: TerminologyConceptScheme
in scheme: TerminologyConceptScheme

RDF description of リニアック・マイクロトロン実施の患者数
primary topic: リニアック・マイクロトロン実施の患者数