マルチスライスCT以外のCT検査装置数
type: TerminologyConcept
description: コンピューターを用いて体内の断層写真を撮影する装置のうち、マルチスライスＣＴ以外の装置の台数。
created: 2017-12-01
broader: Ta00420
top concept of: TerminologyConceptScheme
in scheme: TerminologyConceptScheme

RDF description of マルチスライスCT以外のCT検査装置数
primary topic: マルチスライスCT以外のCT検査装置数