保守計画の実施の状況
type: TerminologyConcept
description: 医療法施行規則（昭和23年厚生省令第50号）第１条の11第２項第３号ハの規定に基づく医療機器の保守点検に関する計画の実施の状況。
created: 2017-12-01
broader: Ta00644
top concept of: TerminologyConceptScheme
in scheme: TerminologyConceptScheme

RDF description of 保守計画の実施の状況
primary topic: 保守計画の実施の状況