脳卒中集中治療室の取扱患者延数
type: TerminologyConcept
description: 「基本診療料の施設基準等」（平成20年厚生労働省告示第62号）の第九の五 脳卒中ケアユニット入院医療管理料の施設基準を満たしているものの患者延数。
created: 2017-12-01
broader: Ta00143
in scheme: TerminologyConceptScheme
top concept of: TerminologyConceptScheme

RDF description of 脳卒中集中治療室の取扱患者延数
primary topic: 脳卒中集中治療室の取扱患者延数