RDF description of 医療機器安全管理責任者の資格
primary topic: 医療機器安全管理責任者の資格

医療機器安全管理責任者の資格
type: TerminologyConcept
in scheme: TerminologyConceptScheme
top concept of: TerminologyConceptScheme
broader: Ta00644
created: 2017-12-01
description: 医療法施行規則（昭和23年厚生省令第50号）第１条の11第２項第３号イの規定に基づいて設けている、医療機器に係る安全管理の責任者の資格。