医薬品安全管理責任者の資格
type: TerminologyConcept
description: 医療法施行規則（昭和23年厚生省令第50号）第１条の11第２項第２号イの規定に基づいて設けている、医薬品に係る安全管理の責任者の資格。
created: 2017-12-01
broader: Ta00644
top concept of: TerminologyConceptScheme
in scheme: TerminologyConceptScheme

RDF description of 医薬品安全管理責任者の資格
primary topic: 医薬品安全管理責任者の資格