生活習慣病の検診の有無
type: TerminologyConcept
description: 高齢者の医療の確保に関する法律（昭和57年法律第80号）第18条第1項の規定に基づく「特定健康診査」に相当する生活習慣病に関する健診の有無。
created: 2017-12-01
broader: Ta00640
top concept of: TerminologyConceptScheme
in scheme: TerminologyConceptScheme

RDF description of 生活習慣病の検診の有無
primary topic: 生活習慣病の検診の有無