RDF description of 在宅当番医制の有無
primary topic: 在宅当番医制の有無

在宅当番医制の有無
type: TerminologyConcept
in scheme: TerminologyConceptScheme
top concept of: TerminologyConceptScheme
broader: Ta00640
created: 2017-12-01
description: 休日、夜間の救急患者の診療を確保するため、地区医師会が実施する在宅当番医制に参加しているかどうかの有無。