RDF description of 経過型介護療養型医療施設病床数
primary topic: 経過型介護療養型医療施設病床数

経過型介護療養型医療施設病床数
type: TerminologyConcept
in scheme: TerminologyConceptScheme
top concept of: TerminologyConceptScheme
broader: Ta00461
created: 2017-12-01
description: 「指定介護療養型医療施設の人員、設備及び運営に関する基準」（平成11年厚生省令第41号）附則第１８条から第２１条までの規定の適用を受ける指定介護療養型医療施設の病床数。