がん手術実施件数
type: TerminologyConcept
description: 当該悪性腫瘍（がん・肉腫等）に対するすべての手術の実施件数。姑息的手術も含む。ただし、生検を目的としたものは除く。
created: 2017-12-01
broader: Ta00402
top concept of: TerminologyConceptScheme
in scheme: TerminologyConceptScheme

RDF description of がん手術実施件数
primary topic: がん手術実施件数