回復期リハビリテーション病棟療養病床数
type: TerminologyConcept
description: 「基本診療料の施設基準等」（平成20年厚生労働省告示第62号）の第九の十 回復期リハビリテーション病棟入院料の施設基準等を満たしている病棟の療養病床数。
created: 2017-12-01
broader: Ta00461
top concept of: TerminologyConceptScheme
in scheme: TerminologyConceptScheme

RDF description of 回復期リハビリテーション病棟療養病床数
primary topic: 回復期リハビリテーション病棟療養病床数