介護予防居宅療養管理指導実施件数
type: TerminologyConcept
description: 通院困難な要支援者の居宅を訪問して、歯科医師等による療養上の管理指導などを行った件数。
created: 2017-12-01
broader: Ta00401
top concept of: TerminologyConceptScheme
in scheme: TerminologyConceptScheme

RDF description of 介護予防居宅療養管理指導実施件数
primary topic: 介護予防居宅療養管理指導実施件数