RDF description of 介護保険移行準備病棟病床数
primary topic: 介護保険移行準備病棟病床数

介護保険移行準備病棟病床数
type: TerminologyConcept
in scheme: TerminologyConceptScheme
top concept of: TerminologyConceptScheme
broader: Ta00461
created: 2017-12-01
description: 「基本診療料の施設基準等」（平成20年厚生労働省告示第62号）の第十一の五に規定する病棟の病床数。