依頼元患者数
type: TerminologyConcept
description: 病院から貸し出された小型の在宅用端末装置を使って患者を結び、テレビの画面、健康データ送信を通じて健康管理を行うものの、依頼元患者数。
created: 2017-12-01
broader: Ta00143
top concept of: TerminologyConceptScheme
in scheme: TerminologyConceptScheme

RDF description of 依頼元患者数
primary topic: 依頼元患者数