LDRの有無
type: TerminologyConcept
description: 入院する病床で、陣痛・分娩から回復までをすごすことができる、居室型分娩室の有無。
created: 2017-12-01
broader: Ta00640
top concept of: TerminologyConceptScheme
in scheme: TerminologyConceptScheme

RDF description of LDRの有無
primary topic: LDRの有無