スクリーン数
type: TerminologyConcept
description: 同一建物、施設内に設置している稼働スクリーン数。スクリーンについては次のように区分される。１．デジタルスクリーン ２．その他のスクリーン
created: 2017-12-01
broader: Ta00417
in scheme: TerminologyConceptScheme
top concept of: TerminologyConceptScheme

RDF description of スクリーン数
primary topic: スクリーン数