RDF description of 座席数
primary topic: 座席数

座席数
type: TerminologyConcept
in scheme: TerminologyConceptScheme
top concept of: TerminologyConceptScheme
broader: Ta00417
created: 2017-12-01
description: 形式、大小を問わず、同一建物・施設内に設置している稼働スクリーンに併設している稼働座席数。