RDF description of 警備費
primary topic: 警備費

警備費
type: TerminologyConcept
in scheme: TerminologyConceptScheme
top concept of: TerminologyConceptScheme
broader: Ta00079
created: 2017-12-01
description: 外部会社のセキュリティシステム導入に係る費用及び派遣等による警備員等の警備業務に係る費用。