RDF description of 教材作成費
primary topic: 教材作成費

教材作成費
type: TerminologyConcept
in scheme: TerminologyConceptScheme
top concept of: TerminologyConceptScheme
broader: Ta00072
created: 2017-12-01
description: 受講生に授業を受講させるために必要な教材を作成するために要した費用（外注により作成した場合も含む）。