RDF description of インターネットを活用した指導方法の採用の有無
primary topic: インターネットを活用した指導方法の採用の有無

インターネットを活用した指導方法の採用の有無
type: TerminologyConcept
in scheme: TerminologyConceptScheme
top concept of: TerminologyConceptScheme
broader: Ta00544
created: 2017-12-01
description: インターネットによるパソコンや携帯端末等を用いた授業及び学習教材の提供などを行っているかの有無。