RDF description of 地代の有無
primary topic: 地代の有無

地代の有無
type: TerminologyConcept
in scheme: TerminologyConceptScheme
top concept of: TerminologyConceptScheme
narrower: si329020030
broader: Ta00566
created: 2017-12-01
description: 持家の場合に地代を支払っているか、支払っていないか、また、支払っていない場合、世帯の家族名義の土地か、離れて住んでいる親等の名義の土地かの別。