RDF description of 購入地域
primary topic: 購入地域

購入地域
type: TerminologyConcept
in scheme: TerminologyConceptScheme
top concept of: TerminologyConceptScheme
narrower: si324020096
narrower: si324020104
broader: Ta00511
created: 2017-12-01
description: 品物を購入した地域が、自宅と同じ市町村か県内の他の市町村か県外の他の市町村かの別。