RDF description of クレジットカード、掛買い、月賦、電子マネーによる購入の品名・用途
primary topic: クレジットカード、掛買い、月賦、電子マネーによる購入の品名・用途

クレジットカード、掛買い、月賦、電子マネーによる購入の品名・用途
type: TerminologyConcept
description: クレジットカード、掛買い、月賦、電子マネーにより購入したもの（支払ではなく購入の時点で計上する。）の品名、用途。電子マネーとは、電子的に行われる決済手段のことで、プリペイド（前払い）方式とポストペイ（後払い）方式に分けられるが、プリペイド方式のみを電子マネーとして扱う。ポストペイ方式はクレジットカードに含める。
created: 2017-12-01
broader: Ta00580
in scheme: TerminologyConceptScheme
narrower: si324020101
narrower: si323020099
top concept of: TerminologyConceptScheme