地上デジタルテレビ放送対応機器所有数
type: TerminologyConcept
description: カラーテレビ、薄型テレビ、ビデオレコーダー、パソコンのうち地上デジタルテレビ放送対応機器の所有総数。ワンセグ放送のみ対応のものは含めない。
created: 2017-12-01
broader: Ta00430
in scheme: TerminologyConceptScheme
narrower: si327020083
top concept of: TerminologyConceptScheme

RDF description of 地上デジタルテレビ放送対応機器所有数
primary topic: 地上デジタルテレビ放送対応機器所有数