民宿利用者数
type: TerminologyConcept
description: 過去１年間の民宿利用者延べ人数。同一人物が複数泊（例えば２泊３日）した場合であっても１人と数え、休憩のみに利用した場合は含めない。
created: 2017-12-01
broader: Ta00148
top concept of: TerminologyConceptScheme
in scheme: TerminologyConceptScheme

RDF description of 民宿利用者数
primary topic: 民宿利用者数