販売金額が最も多かった産業
type: TerminologyConcept
description: 会社が過去１年間に行った漁業以外のすべての事業のうち、販売金額が最も多かった事業。製造業とは、有機又は無機の物質に物理的、化学的変化を加えて製品の製造、卸売をする事業をいう。水産加工業とは、主として水産物を原料として行う製造業をいう。卸売･小売業、飲食業とは、有体的商品を購入して販売する事業及び主として注文によりその場で料理を行ったり、食料品又は飲料を飲食させる事業をいう。サービス業とは、個人又は事業所に対してサービスを提供する事業をいう。冷蔵倉庫業とは、低温装置を施した倉庫に物品を保管することを業とする事業をいう。
created: 2017-12-01
broader: Ta00549
top concept of: TerminologyConceptScheme
in scheme: TerminologyConceptScheme

RDF description of 販売金額が最も多かった産業
primary topic: 販売金額が最も多かった産業