兼業の仕事の種類
type: TerminologyConcept
description: 家として過去１年間に自家漁業以外に行った仕事。自営業とは、自家漁業以外に水産加工業、民宿、農業等を自ら営む場合をいう。勤めとは、賃金報酬を得ることを目的として、雇われて仕事に従事した世帯員がいる場合をいう。
created: 2017-12-01
broader: Ta00530
top concept of: TerminologyConceptScheme
in scheme: TerminologyConceptScheme

RDF description of 兼業の仕事の種類
primary topic: 兼業の仕事の種類