RDF description of 組合員数
primary topic: 組合員数

組合員数
type: TerminologyConcept
in scheme: TerminologyConceptScheme
top concept of: TerminologyConceptScheme
broader: Ta00145
created: 2017-12-01
description: 当該漁協における11月１日現在の正組合員数。漁業協同組合の正組合員の資格の範囲は、内水面に係る組合にあっては次のとおりである。組合の地区内に住居を有し、かつ、漁業を営み若しくはこれに従事し、又は河川において水産動植物の採捕若しくは養殖をする日数が１年を通じて30日から90日までの間で定款に定める日数をこえる個人は、組合の組合員たる資格を有する。（水協法第18条第２項）