RDF description of 漁業への従事の有無_2
primary topic: 漁業への従事の有無_2

漁業への従事の有無_2
type: TerminologyConcept
in scheme: TerminologyConceptScheme
top concept of: TerminologyConceptScheme
broader: Ta00531
created: 2017-12-01
description: 過去１年間に、自家の湖沼漁業に従事した者の有無。自家の湖沼漁業とは、自家単独で湖沼漁業を営んだもの、漁船、漁網を持ち寄って、他人と一緒に湖沼漁業を営んだもの（共同経営は含めない。）、他人の所有する無動力船又は３トン未満の動力漁船にあいのりして湖沼漁業を営んだもの（３トン以上の動力漁船にあいのりした場合は含めない。）をいう。