RDF description of 河川・湖沼関連施設の有無
primary topic: 河川・湖沼関連施設の有無

河川・湖沼関連施設の有無
type: TerminologyConcept
in scheme: TerminologyConceptScheme
top concept of: TerminologyConceptScheme
broader: Ta00615
created: 2017-12-01
description: 内水面組合の管轄区域内における11月１日現在の河川・湖沼関連施設の有無。堰堤とは、水流をせき止めたり、調節するため、河川の途中は湖沼の出入り口に設けられた仕切りをいう。魚礁・魚巣ブロックとは、河川や湖沼に自然石やコンクリートブロック等を人為的に投入、あるいは設置された水産動植物の生息場をいう。産卵場とは、水産動物の産卵を行う場所として、禁漁区の設定水性植物の保護･造成、河床の整備、浮産卵礁の設置、堆積物の除去等を行っている区画をいう。