過去1年以内に漁業を始めたか否か
type: TerminologyConcept
description: 調査期日（調査年11月１日）前１年間に、漁業で恒常的な収入を得ることを目的に主として漁業に従事した者で、新たに漁業を始めた者（過去に漁業に従事していて、再び漁業を始めた者を含む。）、他の仕事が主であったが、漁業が主となった者（他の産業に従事等）、ふだんの状態が仕事を主としていなかったが、漁業が主になった者（学生等）のいずれかに該当するか否かの別。ただし、毎年漁業に従事している場合であって、冬季は漁業以外の仕事をしており、春から漁業を再開する場合は、「過去に漁業に従事していて、再び漁業を始めた者」には含めない。
created: 2017-12-01
broader: Ta00532
top concept of: TerminologyConceptScheme
in scheme: TerminologyConceptScheme

RDF description of 過去1年以内に漁業を始めたか否か
primary topic: 過去1年以内に漁業を始めたか否か