RDF description of 民間事業所所属で役所等で働いている者の数
primary topic: 民間事業所所属で役所等で働いている者の数

民間事業所所属で役所等で働いている者の数
type: TerminologyConcept
description: 会社など別経営の民営の事業所から派遣されている人。【平成21年7月定義内容を変更。変更内容は、下請従業者を含めないようにします、（従前は含めていました。）】
created: 2017-12-01
broader: Ta00121
in scheme: TerminologyConceptScheme
narrower: si410010010
narrower: si410020010
narrower: si410020005
narrower: si410010005
top concept of: TerminologyConceptScheme