支所等の有無
type: TerminologyConcept
broader: Ta00574
description: 他の場所にある同一経営の事業所の統括を受けている事業所のうち、専従の従業者のいる事業所の有無。工場、営業所、出張所、研究所などを含み、専従の従業者のいる倉庫・寮などを含む。
narrower: si408010036
top concept of: TerminologyConceptScheme
created: 2017-12-01
in scheme: TerminologyConceptScheme

RDF description of 支所等の有無
primary topic: 支所等の有無