RDF description of ホールの固定席数
primary topic: ホールの固定席数

ホールの固定席数
type: TerminologyConcept
in scheme: TerminologyConceptScheme
top concept of: TerminologyConceptScheme
broader: Ta00417
created: 2017-12-01
description: 当該施設における３００席以上の固定席（電動により収納移動できる席数を含む。）を有するホールの固定席数。