RDF description of 親子室の有無
primary topic: 親子室の有無

親子室の有無
type: TerminologyConcept
description: 当該館における、乳幼児等と同伴で舞台を鑑賞することが可能な施設で、ホール等において、一般の客席とは分離され、舞台を防音のガラス越しに鑑賞できる設備（スピーカー等）を有する施設の有無。
created: 2017-12-01
broader: Ta00543
in scheme: TerminologyConceptScheme
top concept of: TerminologyConceptScheme