透析治療の状況
type: TerminologyConcept
description: 患者の透析治療の状況をいい、「維持透析治療中」、「その他の透析治療中」、」「治療なし」、「不明」と区分している。なお、調査日に当該医療施設において実際に透析治療を行っていない場合でも、透析治療中であったり、他の医療機関での治療の場合も含む。
created: 2017-12-01
broader: Ta00627
top concept of: TerminologyConceptScheme
in scheme: TerminologyConceptScheme

RDF description of 透析治療の状況
primary topic: 透析治療の状況