持株会社か否か
type: TerminologyConcept
top concept of: TerminologyConceptScheme
broader: Ta00572
narrower: si408020039
description: 持株会社か否かの別。持株会社とは、会社の総資産に対する子会社の株式の取得価額の合計が50％を超える会社。「純粋持株会社」とは、自らは独自に事業を行わず、株式保有によって子会社を支配することを事業とする会社。（「金融持株会社」は「純粋持株会社」に含む。）「事業持株会社」とは、自らも事業を行い、株式保有によって子会社を支配することを事業とする会社。
created: 2017-12-01
narrower: si408010028
narrower: si456010018
in scheme: TerminologyConceptScheme
narrower: si409020039

RDF description of 持株会社か否か
primary topic: 持株会社か否か