指定管理者
type: TerminologyConcept
description: 公立の施設が、地方自治法第２４４条の２第３項に基づき管理者を指定しているか否か、また指定している場合の指定先。
created: 2017-12-01
broader: Ta00572
top concept of: TerminologyConceptScheme
in scheme: TerminologyConceptScheme

RDF description of 指定管理者
primary topic: 指定管理者