RDF description of 就業時間換算雇用者数
primary topic: 就業時間換算雇用者数

就業時間換算雇用者数
type: TerminologyConcept
in scheme: TerminologyConceptScheme
top concept of: TerminologyConceptScheme
broader: Ta00116
created: 2017-12-01
description: 従業者全員の総労働時間（1週間分）を調査対象事業所（企業）の所定労働時間（1週間分）で除して算出した人数。