RDF description of 配信種類
primary topic: 配信種類

配信種類
type: TerminologyConcept
in scheme: TerminologyConceptScheme
top concept of: TerminologyConceptScheme
broader: Ta00580
created: 2017-12-01
description: 配信種類は次の５区分による。 １．ウェブ ２．メール ３．ウェブ上の動画 ４．コンテンツ外部提供 ５．紙面イメージ