印税・原稿料
type: TerminologyConcept
description: 著者（著作権者）に著作権使用料として発行部数見合いで支払った印税方式の経費又は原稿を買い取る形で支払った原稿料などの経費。
created: 2017-12-01
broader: Ta00100
in scheme: TerminologyConceptScheme
top concept of: TerminologyConceptScheme

RDF description of 印税・原稿料
primary topic: 印税・原稿料