リース年間契約台数
type: TerminologyConcept
description: リース（物件を使用させる期間が１年を超え、契約期間中に解約の申し入れができない賃貸契約）の賃貸契約台数。
created: 2017-12-01
broader: Ta00668
top concept of: TerminologyConceptScheme
in scheme: TerminologyConceptScheme

RDF description of リース年間契約台数
primary topic: リース年間契約台数