レコード販売収入額
type: TerminologyConcept
description: レコード販売収入に係る年間売上高について、販売枚数規模区分ごとにそれぞれが占める割合。
created: 2017-12-01
broader: Ta00069
top concept of: TerminologyConceptScheme
in scheme: TerminologyConceptScheme

RDF description of レコード販売収入額
primary topic: レコード販売収入額