RDF description of 映像・音声・文字情報制作に附帯するサービス業の事業形態
primary topic: 映像・音声・文字情報制作に附帯するサービス業の事業形態

映像・音声・文字情報制作に附帯するサービス業の事業形態
type: TerminologyConcept
in scheme: TerminologyConceptScheme
top concept of: TerminologyConceptScheme
broader: Ta00539
created: 2017-12-01
description: 企業の事業形態は、次の６つの区分のうち、主としているものによる。 １．ニュース供給を行う企業 ２．貸スタジオ業を営む企業 ３．撮影スタジオ業を営む企業 ４．ポストプロダクション業を営む企業 ５．音楽スタジオ業を営む企業 ６．１～５以外の映像・音声・文字情報制作に附帯するサービス業務を行う企業